{"text_format":"2","workbook":"xlsx","n_sheets":4,"sheets":["Daten","MS-Spiel 4er mit Formeln","Spieler","Vereine"],"not_rendered":{"charts":0,"images":1,"macros":0,"external_links":0,"defined_names":8,"comments":1,"pivot_tables":0},"unopened":[],"bounds":{"document_bytes":16777216,"sheet_cells":100000,"run_cost":"one","rows_first":2000,"rows_last":500,"rows_between":2000,"halvings":0,"cell_chars":16384,"cell_head_chars":4096},"cells_cut":0,"cells_raw":0,"read":"whole","date_system":"1900"}

{"sheet":"Daten","index":0,"n_rows":29,"n_cols":10,"rows_kept":29,"cut":false,"hidden":false,"merged":[[0,2,1,2],[9,3,9,7],[10,1,10,2],[6,4,6,5],[11,0,12,0],[11,2,12,2],[11,5,11,6],[0,0,1,0],[0,1,1,1],[0,3,0,4],[11,3,11,4],[0,5,0,6],[11,1,12,1],[7,6,7,8],[42,3,42,10],[26,7,26,8],[23,2,23,5],[29,1,29,10],[28,1,28,10],[30,1,30,10],[26,5,26,6],[27,3,27,4],[27,5,27,6],[27,7,27,8],[27,1,27,2],[26,1,26,2],[18,9,18,10],[20,1,20,2],[22,4,22,8],[26,3,26,4],[21,3,21,10],[18,4,18,5],[18,6,18,8],[20,3,20,7],[7,9,7,10],[6,6,6,8],[17,4,17,5],[17,6,17,7],[17,9,17,10],[6,9,6,10],[7,4,7,5]]}
["HEIM","Pass                   nummer","Name","1. DG",null,"2. DG"]
[null,null,null,"Gesamt","Fw","Gesamt","Fw"]
["1. Spieler",null,{"$f":"IF(ISBLANK(B3),\"Bitte Passnr Eingeben\",LOOKUP(B3,Spieler!$A:$A,Spieler!$B:$B) &\" \"&LOOKUP(B3,Spieler!$A:$A,Spieler!$C:$C))","v":"Bitte Passnr Eingeben"}]
["2. Spieler",null,{"$f":"IF(ISBLANK(B4),\"Bitte Passnr Eingeben\",LOOKUP(B4,Spieler!$A:$A,Spieler!$B:$B) &\" \"&LOOKUP(B4,Spieler!$A:$A,Spieler!$C:$C))","v":"Bitte Passnr Eingeben"}]
["3. Spieler",null,{"$f":"IF(ISBLANK(B5),\"Bitte Passnr Eingeben\",LOOKUP(B5,Spieler!$A:$A,Spieler!$B:$B) &\" \"&LOOKUP(B5,Spieler!$A:$A,Spieler!$C:$C))","v":"Bitte Passnr Eingeben"}]
["4. Spieler",null,{"$f":"IF(ISBLANK(B6),\"Bitte Passnr Eingeben\",LOOKUP(B6,Spieler!$A:$A,Spieler!$B:$B) &\" \"&LOOKUP(B6,Spieler!$A:$A,Spieler!$C:$C))","v":"Bitte Passnr Eingeben"}]
["Einwechselspieler",null,{"$f":"IF(ISBLANK(B7),\"Bitte Passnr Eingeben\",LOOKUP(B7,Spieler!$A:$A,Spieler!$B:$B) &\" \"&LOOKUP(B7,Spieler!$A:$A,Spieler!$C:$C))","v":"Bitte Passnr Eingeben"},"ab",null,null,"Wurf für",null,null,{"$f":"IF(F9=1,B3,IF(F9=2,B4,IF(F9=3,B5,IF(F9=4,B6,\"\"))))","v":0}]
["Einwechselspieler",null,{"$f":"IF(ISBLANK(B8),\"Bitte Passnr Eingeben\",LOOKUP(B8,Spieler!$A:$A,Spieler!$B:$B) &\" \"&LOOKUP(B8,Spieler!$A:$A,Spieler!$C:$C))","v":"Bitte Passnr Eingeben"},"ab",null,null,"Wurf für",null,null,{"$f":"IF(F11=1,B3,IF(F11=2,B4,IF(F11=3,B5,IF(F11=4,B6,\"\"))))","v":0}]
["Heimverein:",18,null,null,null,4]
[null,null,"Gilt nur für Cupspiele:","Sudden Victory bei Kegelgleichheit:",null,2]
["Sportkapitän",{"$nulls":4},2]
["GAST",null,"Name","1. DG",null,"2. DG"]
[null,null,null,"Gesamt","Fw","Gesamt","Fw"]
["1. Spieler",null,{"$f":"IF(ISBLANK(B14),\"Bitte Passnr Eingeben\",LOOKUP(B14,Spieler!$A:$A,Spieler!$B:$B) &\" \"&LOOKUP(B14,Spieler!$A:$A,Spieler!$C:$C))","v":"Bitte Passnr Eingeben"}]
["2. Spieler",null,{"$f":"IF(ISBLANK(B15),\"Bitte Passnr Eingeben\",LOOKUP(B15,Spieler!$A:$A,Spieler!$B:$B) &\" \"&LOOKUP(B15,Spieler!$A:$A,Spieler!$C:$C))","v":"Bitte Passnr Eingeben"}]
["3. Spieler",null,{"$f":"IF(ISBLANK(B16),\"Bitte Passnr Eingeben\",LOOKUP(B16,Spieler!$A:$A,Spieler!$B:$B) &\" \"&LOOKUP(B16,Spieler!$A:$A,Spieler!$C:$C))","v":"Bitte Passnr Eingeben"}]
["4. Spieler",null,{"$f":"IF(ISBLANK(B17),\"Bitte Passnr Eingeben\",LOOKUP(B17,Spieler!$A:$A,Spieler!$B:$B) &\" \"&LOOKUP(B17,Spieler!$A:$A,Spieler!$C:$C))","v":"Bitte Passnr Eingeben"}]
["Einwechselspieler",null,{"$f":"IF(ISBLANK(B18),\"Bitte Passnr Eingeben\",LOOKUP(B18,Spieler!$A:$A,Spieler!$B:$B) &\" \"&LOOKUP(B18,Spieler!$A:$A,Spieler!$C:$C))","v":"Bitte Passnr Eingeben"},"ab",null,null,"Wurf für",null,null,{"$f":"IF(F20=1,B14,IF(F20=2,B15,IF(F20=3,B16,IF(F20=4,B17,\"\"))))","v":0}]
["Einwechselspieler",null,{"$f":"IF(ISBLANK(B19),\"Bitte Passnr Eingeben\",LOOKUP(B19,Spieler!$A:$A,Spieler!$B:$B) &\" \"&LOOKUP(B19,Spieler!$A:$A,Spieler!$C:$C))","v":"Bitte Passnr Eingeben"},"ab",null,null,"Wurf für",null,null,{"$f":"IF(H20=1,B14,IF(H20=2,B15,IF(H20=3,B16,IF(H20=4,B17,\"\"))))","v":0}]
["Gastverein:",18,null,null,null,1,null,3]
["Sportkapitän"]
[null,null,null,"Schiedsrichter"]
["Runde",31,null,"Name:",{"$nulls":5},"Nr:"]
["Startzeit:",null,"(im Format HH:MM ausfüllen; zB.: 19:00)"]
["Datum"]
["Liga oder Cup:",1]
["Verwarnung:","Heimverein:  ",null,null,null,"Gastverein:"]
["Protest:","Heimverein:  ",null,null,null,"Gastverein:"]
[null,"Wenn ein Protest vorliegt, bei Heimverein und/oder Gastverin X eintragen"]

{"sheet":"MS-Spiel 4er mit Formeln","index":1,"n_rows":32,"n_cols":27,"rows_kept":32,"cut":false,"hidden":false,"merged":[[11,26,12,26],[12,24,12,25],[7,26,8,26],[7,24,7,25],[8,24,8,25],[10,24,10,25],[11,18,12,19],[12,20,12,21],[12,15,12,17],[11,24,11,25],[9,24,9,25],[11,22,11,23],[1,0,1,1],[3,2,3,3],[9,15,9,17],[8,20,8,21],[7,15,7,17],[8,15,8,17],[7,22,7,23],[6,24,6,25],[8,22,8,23],[6,22,6,23],[5,0,5,12],[1,14,1,16],[2,17,2,23],[1,17,1,23],[7,14,8,14],[2,14,2,16],[5,14,5,26],[3,14,3,16],[3,17,3,23],[9,18,10,19],[9,20,9,21],[7,20,7,21],[1,6,1,9],[1,2,1,3],[0,0,0,26],[9,26,10,26],[9,0,10,0],[10,22,10,23],[10,6,10,7],[8,6,8,7],[11,20,11,21],[10,20,10,21],[11,15,11,17],[10,15,10,17],[11,14,12,14],[9,22,9,23],[6,15,6,17],[6,20,6,21],[9,14,10,14],[7,18,8,19],[12,22,12,23],[2,0,2,1],[11,0,12,0],[7,0,8,0],[6,1,6,3],[11,8,11,9],[2,6,2,9],[3,6,3,9],[2,2,2,3],[11,4,12,5],[11,6,11,7],[10,1,10,3],[6,6,6,7],[8,1,8,3],[7,1,7,3],[7,6,7,7],[6,8,6,9],[6,10,6,11],[3,0,3,1],[7,10,7,11],[9,6,9,7],[9,1,9,3],[9,4,10,5],[15,6,16,7],[13,4,14,5],[9,8,9,9],[10,8,10,9],[10,10,10,11],[12,10,12,11],[12,1,12,3],[11,1,11,3],[7,8,7,9],[11,10,11,11],[14,6,14,7],[14,1,14,3],[17,6,18,7],[17,5,18,5],[15,5,16,5],[13,6,13,7],[7,12,8,12],[8,10,8,11],[8,8,8,9],[7,4,8,5],[12,6,12,7],[9,10,9,11],[12,8,12,9],[11,12,12,12],[9,12,10,12],[15,4,16,4],[20,0,21,2],[18,1,18,3],[17,4,18,4],[15,0,16,0],[13,0,14,0],[15,2,15,3],[16,1,16,3],[13,1,13,3],[17,2,17,3],[17,0,18,0],[29,4,30,6],[14,24,14,25],[13,22,13,23],[15,19,16,19],[14,22,14,23],[13,18,14,19],[13,20,13,21],[13,24,13,25],[15,20,16,21],[15,22,16,26],[14,20,14,21],[14,15,14,17],[13,12,14,12],[13,15,13,17],[15,8,16,12],[13,14,14,14],[13,10,13,11],[13,26,14,26],[21,4,21,6],[21,7,21,8],[17,8,18,12],[14,10,14,11],[13,8,13,9],[14,8,14,9],[15,18,16,18],[23,17,24,26],[23,11,23,12],[31,7,31,9],[26,17,27,26],[17,22,18,26],[29,16,30,16],[15,15,15,17],[16,15,16,17],[15,14,16,14],[25,0,25,9],[20,7,20,8],[29,11,30,12],[20,4,20,6],[26,0,27,9],[29,10,30,10],[28,0,28,9],[20,9,21,11],[23,0,24,9],[29,7,30,9],[31,4,31,6],[31,0,31,3],[29,0,30,3],[31,11,31,14],[25,11,26,12],[29,17,30,22],[20,12,21,12],[25,14,26,14],[17,18,18,18],[17,14,18,14],[18,15,18,17],[17,15,17,17],[25,17,25,26],[20,18,20,20],[29,14,30,14],[31,16,31,22],[17,20,18,21],[21,21,21,22],[17,19,18,19],[28,17,28,26],[20,21,20,22],[20,23,21,25],[20,26,21,26],[21,18,21,20],[20,14,21,16]]}
["S  P  I  E  L  B  E  R  I  C  H  T"]
["RUNDE",null,{"$f":"LOOKUP(Daten!B23,Vereine!A:A,Vereine!I:I)","v":"12 F"},null,null,null,"MEISTERSCHAFT",{"$nulls":7},"   LIGA, KLASSE: ",null,null,{"$f":"LOOKUP(Daten!B26,Vereine!E:E,Vereine!F:F)","v":"Breitensport 2. Landesliga"}]
["DATUM",null,{"$f":"IF(ISBLANK(Daten!B25),\"\",Daten!B25)","v":""},null,null,null,"DAMEN",null,null,null,{"$f":"IF(R2=\"Breitensport 60 Wurf Damen\",\"X\",\"\")","v":""},null,null,null,"   BAHN: ",null,null,"Sportplatz / Kirchdorf "]
["UHRZEIT",null,{"$f":"IF(ISBLANK(Daten!B24),\"\",Daten!B24)","v":""},null,null,null,"HERREN",null,null,null,{"$f":"IF(R2=\"Breitensport 60 Wurf Herren\",\"X\",\"\")","v":""},null,null,null,"   ORT: ",null,null,"Pernegg"]
[]
["HEIMVEREIN",{"$nulls":13},"GASTVEREIN"]
["Pass-NR.","NAME",null,null,"FW",null,"1. Satz",null,"2. Satz",null,"GES",null,"MP",null,"Pass-NR.","NAME",null,null,"FW",null,"1. Satz",null,"2. Satz",null,"GES",null,"MP"]
[{"$f":"IF(ISBLANK(Daten!B3),\"\",(Daten!$B$3))","v":""},{"$f":"IF(ISBLANK(Daten!B3),\"\",LOOKUP(A8,Spieler!$A:$A,Spieler!$B:$B))","v":""},null,null,{"$f":"SUM(Daten!E3,Daten!G3)","v":0},null,{"$f":"Daten!D3","v":0},null,{"$f":"Daten!F3","v":0},null,{"$f":"SUM(G8:J8)","v":0},null,{"$f":"IF(K9>Y9,1,IF(K9<Y9,0,IF(K9=Y9,IF(K8>Y8,1,IF(K8=Y8,0.5,)))))","v":0.5},null,{"$f":"IF(ISBLANK(Daten!$B$14),\"\",(Daten!$B$14))","v":""},{"$f":"IF(ISBLANK(Daten!B14),\"\",LOOKUP(O8,Spieler!$A:$A,Spieler!$B:$B))","v":""},null,null,{"$f":"SUM(Daten!E14,Daten!G14)","v":0},null,{"$f":"Daten!D14","v":0},null,{"$f":"Daten!F14","v":0},null,{"$f":"SUM(U8:X8)","v":0},null,{"$f":"IF(Y9>K9,1,IF(Y9<K9,0,IF(Y9=K9,IF(Y8>K8,1,IF(Y8=K8,0.5,)))))","v":0.5}]
[null,{"$f":"IF(ISBLANK(Daten!B3),\"\",LOOKUP(A8,Spieler!$A:$A,Spieler!$C:$C))","v":""},{"$nulls":4},{"$f":"IF(G8>U8,1,IF(G8=U8,0.5,0))","v":0.5},null,{"$f":"IF(I8>W8,1,IF(I8=W8,0.5,0))","v":0.5},null,1,{"$nulls":4},{"$f":"IF(ISBLANK(Daten!B14),\"\",LOOKUP(O8,Spieler!$A:$A,Spieler!$C:$C))","v":""},{"$nulls":4},{"$f":"IF(U8>G8,1,IF(U8=G8,0.5,0))","v":0.5},null,{"$f":"IF(W8>I8,1,IF(W8=I8,0.5,0))","v":0.5},null,1]
[{"$f":"IF(ISBLANK(Daten!B4),\"\",(Daten!$B$4))","v":""},{"$f":"IF(ISBLANK(Daten!B4),\"\",LOOKUP(A10,Spieler!$A:$A,Spieler!$B:$B))","v":""},null,null,{"$f":"SUM(Daten!E4,Daten!G4)","v":0},null,{"$f":"Daten!D4","v":0},null,{"$f":"Daten!F4","v":0},null,0,null,{"$f":"IF(K11>Y11,1,IF(K11<Y11,0,IF(K11=Y11,IF(K10>Y10,1,IF(K10=Y10,0.5,)))))","v":0.5},null,{"$f":"IF(ISBLANK(Daten!$B$15),\"\",(Daten!$B$15))","v":""},{"$f":"IF(ISBLANK(Daten!B15),\"\",LOOKUP(O10,Spieler!$A:$A,Spieler!$B:$B))","v":""},null,null,{"$f":"SUM(Daten!E15,Daten!G15)","v":0},null,{"$f":"Daten!D15","v":0},null,{"$f":"Daten!F15","v":0},null,0,null,{"$f":"IF(Y11>K11,1,IF(Y11<K11,0,IF(Y11=K11,IF(Y10>K10,1,IF(Y10=K10,0.5,)))))","v":0.5}]
[null,{"$f":"IF(ISBLANK(Daten!B4),\"\",LOOKUP(A10,Spieler!$A:$A,Spieler!$C:$C))","v":""},{"$nulls":4},{"$f":"IF(G10>U10,1,IF(G10=U10,0.5,0))","v":0.5},null,{"$f":"IF(I10>W10,1,IF(I10=W10,0.5,0))","v":0.5},null,1,{"$nulls":4},{"$f":"IF(ISBLANK(Daten!B15),\"\",LOOKUP(O10,Spieler!$A:$A,Spieler!$C:$C))","v":""},{"$nulls":4},{"$f":"IF(U10>G10,1,IF(U10=G10,0.5,0))","v":0.5},null,{"$f":"IF(W10>I10,1,IF(W10=I10,0.5,0))","v":0.5},null,1]
[{"$f":"IF(ISBLANK(Daten!B5),\"\",(Daten!$B$5))","v":""},{"$f":"IF(ISBLANK(Daten!B5),\"\",LOOKUP(A12,Spieler!$A:$A,Spieler!$B:$B))","v":""},null,null,{"$f":"SUM(Daten!E5,Daten!G5)","v":0},null,{"$f":"Daten!D5","v":0},null,{"$f":"Daten!F5","v":0},null,0,null,{"$f":"IF(K13>Y13,1,IF(K13<Y13,0,IF(K13=Y13,IF(K12>Y12,1,IF(K12=Y12,0.5,)))))","v":0.5},null,{"$f":"IF(ISBLANK(Daten!$B$16),\"\",(Daten!$B$16))","v":""},{"$f":"IF(ISBLANK(Daten!B16),\"\",LOOKUP(O12,Spieler!$A:$A,Spieler!$B:$B))","v":""},null,null,{"$f":"SUM(Daten!E16,Daten!G16)","v":0},null,{"$f":"Daten!D16","v":0},null,{"$f":"Daten!F16","v":0},null,0,null,{"$f":"IF(Y13>K13,1,IF(Y13<K13,0,IF(Y13=K13,IF(Y12>K12,1,IF(Y12=K12,0.5,)))))","v":0.5}]
[null,{"$f":"IF(ISBLANK(Daten!B5),\"\",LOOKUP(A12,Spieler!$A:$A,Spieler!$C:$C))","v":""},{"$nulls":4},{"$f":"IF(G12>U12,1,IF(G12=U12,0.5,0))","v":0.5},null,{"$f":"IF(I12>W12,1,IF(I12=W12,0.5,0))","v":0.5},null,1,{"$nulls":4},{"$f":"IF(ISBLANK(Daten!B16),\"\",LOOKUP(O12,Spieler!$A:$A,Spieler!$C:$C))","v":""},{"$nulls":4},{"$f":"IF(U12>G12,1,IF(U12=G12,0.5,0))","v":0.5},null,{"$f":"IF(W12>I12,1,IF(W12=I12,0.5,0))","v":0.5},null,1]
[{"$f":"IF(ISBLANK(Daten!B6),\"\",(Daten!$B$6))","v":""},{"$f":"IF(ISBLANK(Daten!B6),\"\",LOOKUP(A14,Spieler!$A:$A,Spieler!$B:$B))","v":""},null,null,{"$f":"SUM(Daten!E6,Daten!G6)","v":0},null,{"$f":"Daten!D6","v":0},null,{"$f":"Daten!F6","v":0},null,0,null,{"$f":"IF(K15>Y15,1,IF(K15<Y15,0,IF(K15=Y15,IF(K14>Y14,1,IF(K14=Y14,0.5,)))))","v":0.5},null,{"$f":"IF(ISBLANK(Daten!$B$17),\"\",(Daten!$B$17))","v":""},{"$f":"IF(ISBLANK(Daten!B17),\"\",LOOKUP(O14,Spieler!$A:$A,Spieler!$B:$B))","v":""},null,null,{"$f":"SUM(Daten!E17,Daten!G17)","v":0},null,{"$f":"Daten!D17","v":0},null,{"$f":"Daten!F17","v":0},null,0,null,{"$f":"IF(Y15>K15,1,IF(Y15<K15,0,IF(Y15=K15,IF(Y14>K14,1,IF(Y14=K14,0.5,)))))","v":0.5}]
[null,{"$f":"IF(ISBLANK(Daten!B6),\"\",LOOKUP(A14,Spieler!$A:$A,Spieler!$C:$C))","v":""},{"$nulls":4},{"$f":"IF(G14>U14,1,IF(G14=U14,0.5,0))","v":0.5},null,{"$f":"IF(I14>W14,1,IF(I14=W14,0.5,0))","v":0.5},null,1,{"$nulls":4},{"$f":"IF(ISBLANK(Daten!B17),\"\",LOOKUP(O14,Spieler!$A:$A,Spieler!$C:$C))","v":""},{"$nulls":4},{"$f":"IF(U14>G14,1,IF(U14=G14,0.5,0))","v":0.5},null,{"$f":"IF(W14>I14,1,IF(W14=I14,0.5,0))","v":0.5},null,1]
[{"$f":"IF(ISBLANK(Daten!B7),\"\",(Daten!$B$7))","v":""},null,"Ersatzspieler/in",null,"ab",{"$f":"IF(ISBLANK(Daten!E7),\"\",IF(ISBLANK(Daten!B7),\"\",Daten!E7&\"\"&\".\"))","v":""},"Wurf für",null,{"$f":"IF(ISBLANK(Daten!$E$7),\"\",IF(ISBLANK(Daten!B7),\"\",LOOKUP(Daten!$J$7,Spieler!A:A,Spieler!B:B)&\" \"&LOOKUP(Daten!$J$7,Spieler!$A:$A,Spieler!$C:$C)))","v":""},{"$nulls":5},{"$f":"IF(ISBLANK(Daten!$B$18),\"\",(Daten!$B$18))","v":""},"Ersatzspieler/in",null,null,"ab",{"$f":"IF(ISBLANK(Daten!E18),\"\",IF(ISBLANK(Daten!B18),\"\",Daten!E18&\"\"&\".\"))","v":""},"Wurf für",null,{"$f":"IF(ISBLANK(Daten!$E$18),\"\",IF(ISBLANK(Daten!B18),\"\",LOOKUP(Daten!$J$18,Spieler!A:A,Spieler!B:B)&\" \"&LOOKUP(Daten!$J$18,Spieler!$A:$A,Spieler!$C:$C)))","v":""}]
[null,{"$f":"IF(ISBLANK(Daten!B7),\"\",LOOKUP(A16,Spieler!$A:$A,Spieler!$B:$B)&\" \"&LOOKUP(A16,Spieler!$A:$A,Spieler!$C:$C))","v":""},null,null,null,{"$f":"IF(ISBLANK(Daten!D7),\"\",IF(ISBLANK(Daten!A7),\"\",Daten!D7&\"\"&\".\"))","v":"ab."},{"$nulls":9},{"$f":"IF(ISBLANK(Daten!B18),\"\",LOOKUP(O16,Spieler!$A:$A,Spieler!$B:$B)&\" \"&LOOKUP(O16,Spieler!$A:$A,Spieler!$C:$C))","v":""}]
[{"$f":"IF(ISBLANK(Daten!B8),\"\",(Daten!$B$8))","v":""},null,"Ersatzspieler/in",null,"ab",{"$f":"IF(ISBLANK(Daten!E8),\"\",IF(ISBLANK(Daten!B8),\"\",Daten!E8&\"\"&\".\"))","v":""},"Wurf für",null,{"$f":"IF(ISBLANK(Daten!$E$8),\"\",IF(ISBLANK(Daten!B8),\"\",LOOKUP(Daten!$J$8,Spieler!A:A,Spieler!B:B)&\" \"&LOOKUP(Daten!$J$8,Spieler!$A:$A,Spieler!$C:$C)))","v":""},{"$nulls":5},{"$f":"IF(ISBLANK(Daten!$B$19),\"\",(Daten!$B$19))","v":""},"Ersatzspieler/in",null,null,"ab",{"$f":"IF(ISBLANK(Daten!E19),\"\",IF(ISBLANK(Daten!B19),\"\",Daten!E19&\"\"&\".\"))","v":""},"Wurf für",null,{"$f":"IF(ISBLANK(Daten!$E$19),\"\",IF(ISBLANK(Daten!B19),\"\",LOOKUP(Daten!$J$19,Spieler!A:A,Spieler!B:B)&\" \"&LOOKUP(Daten!$J$19,Spieler!$A:$A,Spieler!$C:$C)))","v":""}]
[null,{"$f":"IF(ISBLANK(Daten!B8),\"\",LOOKUP(A18,Spieler!$A:$A,Spieler!$B:$B)&\" \"&LOOKUP(A18,Spieler!$A:$A,Spieler!$C:$C))","v":""},null,null,null,{"$f":"IF(ISBLANK(Daten!D9),\"\",IF(ISBLANK(Daten!A9),\"\",Daten!D9&\"\"&\".\"))","v":""},{"$nulls":9},{"$f":"IF(ISBLANK(Daten!B19),\"\",LOOKUP(O18,Spieler!$A:$A,Spieler!$B:$B)&\" \"&LOOKUP(O18,Spieler!$A:$A,Spieler!$C:$C))","v":""}]
[]
["GESAMTLEISTUNG",null,null,{"$f":"SUM(K8,K10,K12,K14)","v":0},{"$f":"D21/4","v":0},null,null,{"$f":"SUM(E8,E10,E12,E14)","v":0},null,"MP",null,null,{"$f":"IF(D21>R21,2,IF(D21<R21,0,IF(D21=R21,1,)))","v":1},null,"GESAMTLEISTUNG",null,null,{"$f":"SUM(Y8,Y10,Y12,Y14)","v":0},{"$f":"R21/4","v":0},null,null,{"$f":"SUM(S8,S10,S12,S14)","v":0},null,"MP",null,null,{"$f":"IF(R21>D21,2,IF(R21<D21,0,IF(R21=D21,1,)))","v":1}]
[null,null,null,"Kegel","Schnitt",null,null,"FW",{"$nulls":9},"Kegel","Schnitt",null,null,"FW"]
[]
[{"$f":"LOOKUP(Daten!B9,Vereine!A:A,Vereine!B:B)","v":0},{"$nulls":10},{"$f":"SUM(K9,K11,K13,K15)","v":4},null,null,{"$f":"SUM(Y9,Y11,Y13,Y15)","v":4},null,null,{"$f":"LOOKUP(Daten!B20,Vereine!A:A,Vereine!B:B)","v":0}]
[{"$nulls":13},"SATZPUNKTE"]
["HEIMVEREIN",{"$nulls":10},{"$f":"SUM(M8,M10,M12,M14,M21)","v":3},null,null,{"$f":"SUM(AA8,AA10,AA12,AA14,AA21)","v":3},null,null,"GASTVEREIN"]
[{"$f":"Daten!B11","v":0},{"$nulls":16},{"$f":"Daten!B21","v":0}]
[{"$nulls":13},"MANNSCHAFTSPUNKTE"]
["SPORTKAPITÄN",{"$nulls":16},"SPORTKAPITÄN"]
[{"$f":"IF(ISBLANK(Daten!$E$23),\"\",Daten!$E$23)","v":""},null,null,null,6,null,null,{"$f":"IF(ISBLANK(Daten!$K$23),\"\",Daten!$K$23)","v":""},null,null,null,{"$f":"IF(L26>O26,2,IF(L26<O26,0,IF(L26=O26,1,)))","v":1},null,null,{"$f":"IF(O26>L26,2,IF(O26<L26,0,IF(O26=L26,1,)))","v":1},{"$nulls":10},"HV","GV"]
[{"$nulls":23},"VERWARNUNG"]
["Schiedsrichter  -  N A M E",null,null,null,"LV",null,null,"NR",null,null,null,"TABELLENPUNKTE",{"$nulls":4},"       SCHIEDSRICHTER",{"$nulls":6},"PROTEST"]

{"sheet":"Spieler","index":2,"n_rows":185,"n_cols":3,"rows_kept":185,"cut":false,"hidden":false,"merged":[]}
["PNr","Nachname","Vorname"]
[61002,"WAXENEGGER","Augustin"]
[61003,"THALLER","Günter"]
[61004,"APOLLONER","Augustin"]
[61006,"DERLER ","Helmut"]
[61007,"NEUBAUER","Hans-Jürgen"]
[61009,"LECHNER","Josef"]
[61010,"PICHLER","Markus"]
[61013,"BIRCHBAUER","Horst"]
[61014,"KREINER","Wolfgang"]
[61015,"EIBISBERGER","Jakob"]
[61016,"PUSTERHOFER","Franz"]
[61017,"SCHWEIGER ","Peter"]
[61019,"STEININGER","Engelbert"]
[61020,"KOGLER","Franz"]
[61021,"GSCHAIDER ","Wolfgang"]
[61022,"JANTSCHER","Manuel"]
[61023,"ALLMER","Karl"]
[61024,"STROBL","Werner"]
[61025,"SCHWEIGER ","Peter"]
[61026,"PRADE ","Alfred"]
[61027,"KORNHOFER","Peter"]
[61028,"LEINDL","Rudolf"]
[61029,"ZECHNER","Gerhard"]
[61030,"PAYRHOFER ","Manfred"]
[61031,"GRIESSER","Kurt"]
[61032,"INZINGER ","Heinz"]
[61034,"NÖST","Thomas"]
[31035,"MOSER","Christopher"]
[61036,"WÖLS","Franz"]
[61037,"REITER","Heribert"]
[61038,"ILLMAIER","Friedrich"]
[61039,"ELLMAIER","Martin"]
[61040,"SCHMOLL","Jürgen"]
[61041,"NIESSENBACHER","Helmut"]
[61042,"BACHER ","Adolf"]
[61043,"BERGER","Gerhard"]
[61044,"TAßLER ","Wolfgang"]
[61045,"FEICHTER","Heinz"]
[61046,"WÖLS","Franz"]
[61047,"PICHLER ","Robert"]
[61048,"MOSER","Erwin"]
[61049,"GABRIEL","Hans"]
[61050,"JÜRGENS","Josef"]
[61051,"MAGRITZER","Johann"]
[61052,"MARL","Otmar"]
[61054,"BRANDNER","Hubert"]
[61055,"DERLER ","Ernst"]
[61056,"CRESNIK","Peter"]
[61057,"LAIMER","Egon"]
[61058,"EGGENREICH","Thomas"]
[61059,"ROJAK","Siegfried"]
[61060,"HIEBLER","Egon"]
[61061,"KORNTHALER","Michael"]
[61062,"KOLLAND","Herwig"]
[61063,"KORNTHALER","Manfred"]
[61064,"LUTTENBERGER","Gerhard"]
[61065,"NIEDERL ","Johann"]
[61066,"FORSTNER","Johann"]
[61067,"KOGLER","Johann"]
[61068,"DÖRFLINGER","Kurt"]
[61069,"EIBISBERGER","Franz"]
[61070,"FUCHS","Alois"]
[61071,"BRANDNER","Silvester"]
[61072,"LEITNER","Johann"]
[61073,"MARX","August "]
[61074,"SCHÖNGRUNDNER","Walter"]
[61075,"LEINDL","Johann"]
[61076,"HÖSSL","Johann"]
[61077,"EDELSBRUNNER","Helmut"]
[61078,"LEODOLTER","Hubert"]
[61079,"KAPUN","Herbert"]
[61080,"KOHLMEIER","Ludwig"]
[61081,"RUST","Horst"]
[61082,"MODER","Herbert"]
[61083,"ÖKRÖS","Laszlo"]
[61084,"DOPPELHOFER","Konrad"]
[61085,"LEDERER","Roland"]
[61086,"SCHREINER","Rupert"]
[61087,"GLASER","Karl"]
[61089,"WIEDNER","Johann"]
[61090,"GRÖBMINGER","Wilfried"]
[61091,"KOLLAND","Clemens"]
[61092,"GAUKLER","Nikolaus"]
[61093,"SCHREINER","Walter"]
[61094,"NAGORNIK","Siegfried"]
[61095,"HOLZER","Karl"]
[61096,"PIRZL ","Johann"]
[61097,"POSCH","Johann"]
[61098,"REITER","Ernst"]
[61099,"SUNKO","Erich"]
[61100,"KRASSER","Marcel"]
[61103,"BIRCHBAUER","Helmut"]
[61104,"KRAMMER","Eduard"]
[61105,"KRUPITSCHEFF","Günther"]
[61106,"BRANDNER","Manfred"]
[61107,"HOLLERER","Josef"]
[61108,"HOCHSTEINER","Mathias"]
[61110,"FAUSTER","Karl"]
[61111,"SCHNEIDER ","Ewald"]
[61112,"MAUERHOFER ","Herbert"]
[61113,"HAGENAUER","Erich"]
[61114,"FRITZ","Raimund"]
[61115,"BREITENEGGER","Heinz"]
[61116,"LIEBMANN","Ewald"]
[61117,"SPÖRK","Gottfried"]
[61118,"BÜRGER","Fritz"]
[61119,"URCH","Valentin"]
[61120,"LEDOLTER","Otto"]
[61121,"REITBAUER","Hans"]
[61122,"JANTSCHER","Mario"]
[61124,"WINKLER","Josef"]
[61125,"LASTIN","Erich"]
[61126,"WEISSENBACHER","Mario"]
[61127,"STOCKREITER","Christian"]
[61128,"REITER","Mario"]
[66000,"HAMMERLINDL ","Hermine"]
[66001,"SCHÖNGRUNDNER","Lucia"]
[66002,"LECHNER","Frieda"]
[66004,"AXDORFER","Karla"]
[66005,"SEEBACHER","Ingeborg"]
[66006,"NISEVIC","Ilse"]
[66007,"FASCHING ","Petra"]
[66009,"HUBER","Hilde"]
[66010,"PFEFFER","Margit"]
[66012,"KAPUN","Veronika"]
[66013,"WIEDNER","Helga"]
[66014,"BACHER-WALCHER","Sonja"]
[66015,"GREIN","Elisabeth"]
[66016,"KLAMMER","Stefanie"]
[66019,"DERLER ","Monika"]
[66020,"SPREITZ","Angelika"]
[66021,"PODLIPNIK","Silvia"]
[66022,"STROBL","Christine"]
[66023,"RATH","Alma"]
[66025,"URCH","Eva"]
[66026,"KRAMMER","Alexandra"]
[66027,"WIMMER","Nicole"]
[66029,"DÜREGGER","Petra"]
[66030,"EGLAUER","Luise"]
[66031,"GREIMEL","Friederike"]
[66032,"POSCH","Gabriele"]
[66033,"HIEBLER","Jutta"]
[66034,"INZINGER ","Sabine"]
[66035,"EIBISBERGER","Johanna"]
[66036,"ÜBERLEITNER","Stefanie"]
[66037,"ORTHABER","Hermine"]
[66038,"PILLHOFER","Margareta"]
[66039,"WOHLMUTHER","Magdalena"]
[66041,"TIEFENGRABER","Isabella"]
[66043,"ERHART","Elisabeth"]
[66044,"ROTTER","Margarete"]
[66045,"MODER","Gabriele"]
[66046,"PRETSCHUH","Ulrike"]
[66047,"NIEDERL ","Erna"]
[66048,"GÜNTHER","Lieselotte"]
[66049,"ETTLMAYER","Angelika"]
[66050,"BRANDNER","Christine"]
[66051,"KOHLBACHER","Josefine"]
[66052,"DÜREGGER","Beatrix"]
[66053,"FRITZ","Anna"]
[66054,"SPÖRK","Sigrid"]
[66055,"TAßLER ","Johanna Gabriela"]
[66056,"SCHNEIDER ","Sakhon"]
[66057,"AICHNER","Berit"]
[66058,"STRAUBINGER","Anna"]
[66059,"KOGLER","Rosa"]
[66060,"PETZ","Hilde"]
[66061,"LEITOLD","Berta"]
[66062,"REITER","Roswitha"]
[66063,"TAßLER ","Yvonne"]
[66064,"HUBER","Carola"]
[66065,"HÜBL","Sonja"]
[66066,"PRODINGER","Monika"]
[66067,"SCHMOLL","Sylvia"]
[66068,"ROHRMOSER","Marianne"]
[66069,"KRUPITSCHEFF","Ingrid"]
[66070,"WIESER","Stefanie"]
[66071,"BRANDNER","Juliane"]
[66072,"KRASSER-HOLLERER","Helga"]
[66073,"EBNER","Elisabeth"]
[66074,"PÖLLABAUER","Margret"]
[66076,"REIBENBACHER","Marianne"]
[66078,"KRASSER ","Manuela"]
[66079,"BRAUN","Helga"]

{"sheet":"Vereine","index":3,"n_rows":29,"n_cols":9,"rows_kept":29,"cut":false,"hidden":false,"merged":[]}
["Kennziffer","Verein","Ort","Bahn","Bez","Liga",null,"R","Bez"]
[1,"WSV Liezen 2","Liezen","Angern Bahnen",1,"Breitensport 2. Landesliga",null,1,"1 H"]
[2,"ESV JUFA Bruck 2","Bruck/Mur","JUFA Weitental",null,null,null,2,"2 H"]
[3,"ESV-SKC Kapfenberg","Kapfenberg","Stangl/Kapfenberg",null,null,null,3,"3 H"]
[4,"ESV  Leoben 2","Leoben","ESV Bahnen",null,null,null,4,"4 H"]
[5,"SV Breitenau 1","Kapfenberg","Stangl/Kapfenberg",null,null,null,5,"5 H"]
[6,"SC Pernegg 3","Pernegg","Kirchdorf Sportplatz",null,null,null,6,"6 H"]
[7,"PKC Thörl 3","Tragöß","GH Petutschnig",null,null,null,7,"7 H"]
[8,"PKC Thörl 4","Tragöß","GH Petutschnig",null,null,null,8,"8 H"]
[9,"SV Mayr Melnhof 1","Leoben","Kammersäle",null,null,null,9,"9 H"]
[10,"SV Mayr Melnhof 2","Leoben","Kammersäle",null,null,null,10,"10H"]
[11,"SKK Jufa Fürstenfeld","Fürstenfeld","Jufa Fürstenfeld",null,null,null,11,"11H"]
[12,"SV Breitenau 2","Kapfenberg","Stangl/Kapfenberg",null,null,null,12,"12H"]
[13,"KG Rothleiten 2","Pernegg","Kirchdorf Sportplatz",null,null,null,13,"13H"]
[14,"PKC Thörl 5","Tragöß","GH Petutschnig",null,null,null,14,"14 H"]
[15,{"$nulls":6},15,"1 F"]
[16,{"$nulls":6},16,"2 F"]
[17,{"$nulls":6},17,"3 F"]
[18,{"$nulls":6},18,"4 F"]
[19,{"$nulls":6},19,"5 F"]
[20,{"$nulls":6},20,"6 F"]
[21,{"$nulls":7},"7 F"]
[22,{"$nulls":7},"8 F"]
[23,{"$nulls":7},"9 F"]
[24,{"$nulls":7},"10 F"]
[25,{"$nulls":6},21,"11 F"]
[26,{"$nulls":6},22,"12 F"]
[{"$nulls":8},"13 F"]
[{"$nulls":8},"14 F"]